Target
5-hydroxytryptamine receptor 7
Ligand
BDBM50098550
Substrate
Meas. Tech.
ChEMBL_3768 (CHEMBL620767)
Ki
79±n/a nM
Citation
 López-Rodríguez, MLPorras, EMorcillo, MJBenhamú, BSoto, LJLavandera, JLRamos, JAOlivella, MCampillo, MPardo, L Optimization of the pharmacophore model for 5-HT7R antagonism. Design and synthesis of new naphtholactam and naphthosultam derivatives. J Med Chem 46:5638-50 (2003)  
Target
Name:
5-hydroxytryptamine receptor 7
Synonyms:
5-HT-7 5-HT7 5-HT7S 5-hydroxytryptamine receptor 7 5HT7R_RAT GPRFO Serotonin (5-HT) receptor | Serotonin Receptor 7
Type:
G Protein-Coupled Receptor (GPCR)
Mol. Mass.:
49852.62
Organism:
Rattus norvegicus (rat)
Description:
Rat cloned 5-HT7R.
Residue:
448
  
Inhibitor
Name:
BDBM50098550
Synonyms:
3,N-Dimethyl-N-[(R)-1-methyl-3-(4-methyl-piperidin-1-yl)-propyl]-benzenesulfonamide 3,N-Dimethyl-N-[1-methyl-3-(4-methyl-piperidin-1-yl)-propyl]-benzenesulfonamide (SB-258719) CHEMBL12264 | SB-258719
Type:
Small organic molecule
Emp. Form.:
C18H30N2O2S
Mol. Mass.:
338.508
SMILES:
C[C@H](CCN1CCC(C)CC1)N(C)S(=O)(=O)c1cccc(C)c1
: