Target
Histamine H1 receptor
Ligand
BDBM50297307
Substrate
Meas. Tech.
ChEMBL_84555 (CHEMBL692990)
Ki
0.436516±n/a nM
Citation
 Böhme, TMKeim, CKreutzmann, KLinder, MDingermann, TDannhardt, GMutschler, ELambrecht, G Structure-activity relationships of dimethindene derivatives as new M2-selective muscarinic receptor antagonists. J Med Chem 46:856-67 (2003)  
Target
Name:
Histamine H1 receptor
Synonyms:
H1R HISTAMINE H1 HRH1_HUMAN
Type:
G Protein-Coupled Receptor (GPCR)
Mol. Mass.:
55808.72
Organism:
Homo sapiens (Human)
Description:
Cell pellets from SK-N-MC cells transfected with human H1 receptor were used in binding assay.
Residue:
487
  
Inhibitor
Name:
BDBM50297307
Synonyms:
CHEMBL564226 | R-dimethindene
Type:
Small organic molecule
Emp. Form.:
C20H24N2
Mol. Mass.:
292.418
SMILES:
C[C@H](C1=C(CCN(C)C)Cc2ccccc12)c1ccccn1
: