Target
Muscarinic acetylcholine receptor M2
Ligand
BDBM50074555
Substrate
Meas. Tech.
ChEMBL_140026 (CHEMBL745569)
EC50
1380±n/a nM
Citation
 Stiefl, NBaumann, K Mapping property distributions of molecular surfaces: algorithm and evaluation of a novel 3D quantitative structure-activity relationship technique. J Med Chem 46:1390-407 (2003)  
Target
Name:
Muscarinic acetylcholine receptor M2
Synonyms:
ACM2_PIG Cholinergic, muscarinic LOC100715343 Muscarinic receptor 2
Type:
Enzyme Catalytic Domain
Mol. Mass.:
51688.65
Organism:
GUINEA PIG
Description:
Cholinergic, muscarinic 0 GUINEA PIG::P06199
Residue:
466
  
Inhibitor
Name:
BDBM50074555
Synonyms:
Bis-{3-(1,3-dioxo-2,3-dihydro-1H-2-isoindolyl)propyl(trimethyl)ammonium}propane; dibromide | CHEMBL168760
Type:
Small organic molecule
Emp. Form.:
C31H42N4O4
Mol. Mass.:
534.6885
SMILES:
C[N+](C)(CCCCC[N+](C)(C)CCCN1C(=O)c2ccccc2C1=O)CCCN1C(=O)c2ccccc2C1=O
: