Target
Corticosteroid-binding globulin
Ligand
BDBM8885
Substrate
Meas. Tech.
ChEMBL_48199 (CHEMBL665995)
Ki
191±n/a nM
Citation
 Kotani, THigashiura, K Comparative molecular active site analysis (CoMASA). 1. An approach to rapid evaluation of 3D QSAR. J Med Chem 47:2732-42 (2004)  
Target
Name:
Corticosteroid-binding globulin
Synonyms:
CBG Corticosteroid binding globulin | SERPINA6
Type:
PROTEIN
Mol. Mass.:
45136.82
Organism:
Homo sapiens
Description:
ChEMBL_10503
Residue:
405
  
Inhibitor
Name:
BDBM8885
Synonyms:
(1S,2R,10R,11S,14S,15S)-14-hydroxy-2,15-dimethyltetracyclo[8.7.0.0^{2,7}.0^{11,15}]heptadec-6-en-5-one Testosterone US9682960, Testosterone
Type:
Steroid
Emp. Form.:
C19H28O2
Mol. Mass.:
288.4244
SMILES:
[H][C@@]12CC[C@H](O)[C@@]1(C)CC[C@@]1([H])[C@@]2([H])CCC2=CC(=O)CC[C@]12C
: