Target
Orexin receptor type 2
Ligand
BDBM50412862
Substrate
Meas. Tech.
ChEMBL_304040 (CHEMBL840218)
Ki
20±n/a nM
Citation
 McAtee, LCSutton, SWRudolph, DALi, XAluisio, LEPhuong, VKDvorak, CALovenberg, TWCarruthers, NIJones, TK Novel substituted 4-phenyl-[1,3]dioxanes: potent and selective orexin receptor 2 (OX(2)R) antagonists. Bioorg Med Chem Lett 14:4225-9 (2004)  
Target
Name:
Orexin receptor type 2
Synonyms:
HCRTR2 OX2R_HUMAN Orexin receptor type 2 (OR-2) Orexin receptor type 2 (OX2R) Ox-2-R | Ox2-R
Type:
Protein
Mol. Mass.:
50710.53
Organism:
Homo sapiens (Human)
Description:
O43614
Residue:
444
  
Inhibitor
Name:
BDBM50412862
Synonyms:
CHEMBL185136
Type:
Small organic molecule
Emp. Form.:
C19H20Cl2N2O3
Mol. Mass.:
395.28
SMILES:
CC1(C)OC[C@H](NC(=O)Nc2ccc(Cl)cc2Cl)[C@@H](O1)c1ccccc1
: