Target
Vascular endothelial growth factor receptor 1/2/3
Ligand
BDBM50154511
Substrate
Meas. Tech.
ChEMBL_313055 (CHEMBL835746)
IC50
22000±n/a nM
Citation
 Lobb, KLHipskind, PAAikins, JAAlvarez, ECheung, YYConsidine, ELDe Dios, ADurst, GLFerritto, RGrossman, CSGiera, DDHollister, BAHuang, ZIversen, PWLaw, KLLi, TLin, HSLopez, BLopez, JECabrejas, LMMcCann, DJMolero, VReilly, JERichett, MEShih, CTeicher, BWikel, JHWhite, WTMader, MM Acyl sulfonamide anti-proliferatives: benzene substituent structure-activity relationships for a novel class of antitumor agents. J Med Chem 47:5367-80 (2004)  
Target
Name:
Vascular endothelial growth factor receptor 1/2/3
Synonyms:
Vascular endothelial growth factor receptor
Type:
Mol. Mass.:
Description:
ASSAY_ID of ChEMBL is 213950
Components:
This complex has 3 components.
Component 1
Name:
Vascular endothelial growth factor receptor 2
Synonyms:
CD_antigen=CD309 Fetal liver kinase 1 (FLK-1) KDR Protein-tyrosine kinase receptor Flk-1 VEGFR-2 VEGFR2 Vascular Endothelial Growth Factor Receptor Kinase 2 Vascular endothelial growth factor receptor 2 (KDR) Vascular endothelial growth factor receptor 2 (VEGFR2) Vascular endothelial growth factor receptor-2 (VEGFR-2)
Type:
Receptor Tyrosine Kinase
Mol. Mass.:
151510.97
Organism:
Homo sapiens (Human)
Description:
P35968
Residue:
1356
  
Component 2
Name:
Vascular endothelial growth factor receptor 1
Synonyms:
FLT FRT Fms-like tyrosine kinase 1 Tyrosine-protein kinase FRT VEGFR-1 VGFR1_HUMAN Vascular endothelial growth factor receptor 1 (FLT1) Vascular endothelial growth factor receptor 1 and 2 (Flt-1 and KDR) Vascular permeability factor receptor vascular endothelial growth factor/vascular permeability factor receptor
Type:
Receptor Tyrosine Kinase
Mol. Mass.:
150800.23
Organism:
Homo sapiens (Human)
Description:
P17948
Residue:
1338
  
Component 3
Name:
Vascular endothelial growth factor receptor 3
Synonyms:
FLT-4 Fms-like tyrosine kinase 4 VEGFR-3 VGFR3_HUMAN Vascular endothelial growth factor receptor 3 (VEGFR-3) | Vascular endothelial growth factor receptor 3 (VEGFR3)
Type:
Protein
Mol. Mass.:
152749.58
Organism:
Homo sapiens (Human)
Description:
P35916-2
Residue:
1363
  
Inhibitor
Name:
BDBM50154511
Synonyms:
CHEMBL189770 N-Benzoyl-4-chloro-benzenesulfonamide
Type:
Small organic molecule
Emp. Form.:
C13H10ClNO3S
Mol. Mass.:
295.741
SMILES:
Clc1ccc(cc1)S(=O)(=O)NC(=O)c1ccccc1
: