Target
Neuronal acetylcholine receptor subunit alpha-4/beta-4
Ligand
BDBM50171007
Substrate
Meas. Tech.
ChEMBL_320941 (CHEMBL882460)
Ki
3.6±n/a nM
Citation
 Huang, YZhu, ZXiao, YLaruelle, M Epibatidine analogues as selective ligands for the alpha(x)beta2-containing subtypes of nicotinic acetylcholine receptors. Bioorg Med Chem Lett 15:4385-8 (2005)  
Target
Name:
Neuronal acetylcholine receptor subunit alpha-4/beta-4
Synonyms:
Neuronal acetylcholine receptor protein alpha-4/beta-4 subunit nAChR subtypes alpha4 beta4
Type:
Mol. Mass.:
Description:
ASSAY_ID of EBI is 144014
Components:
This complex has 2 components.
Component 1
Name:
Neuronal acetylcholine receptor subunit alpha-4
Synonyms:
ACHA4_RAT Cholinergic, Nicotinic Alpha4Beta2 Chrna4 Neuronal acetylcholine receptor (alpha4beta2 nAChR) Neuronal acetylcholine receptor subunit alpha 4 beta 2 | Neuronal acetylcholine receptor subunit alpha-4
Type:
Enzyme
Mol. Mass.:
70196.44
Organism:
Rattus norvegicus (Rat)
Description:
P09483
Residue:
630
  
Component 2
Name:
Neuronal acetylcholine receptor subunit beta-4
Synonyms:
ACHB4_RAT Chrnb4 Neuronal acetylcholine receptor non-alpha-2 chain | Neuronal acetylcholine receptor protein beta-4 subunit
Type:
Enzyme
Mol. Mass.:
55863.89
Organism:
Rattus norvegicus (Rat)
Description:
P12392
Residue:
495
  
Inhibitor
Name:
BDBM50171007
Synonyms:
4-[5-(7-Aza-bicyclo[2.2.1]hept-2-yl)-2-fluoro-pyridin-3-yl]-benzonitrile US9150581, RTI-7527-155
Type:
Small organic molecule
Emp. Form.:
C18H16FN3
Mol. Mass.:
293.3381
SMILES:
Fc1ncc(cc1-c1ccc(cc1)C#N)C1CC2CCC1N2
: