Target
Dual specificity calcium/calmodulin-dependent 3',5'-cyclic nucleotide phosphodiesterase 1A/1B
Ligand
BDBM50009385
Substrate
Meas. Tech.
ChEMBL_329671 (CHEMBL864631)
IC50
>500000±n/a nM
Citation
 Delcros, JGTomasi, SDuhieu, SFoucault, MMartin, BLe Roch, MEifler-Lima, VRenault, JUriac, P Effect of polyamine homologation on the transport and biological properties of heterocyclic amidines. J Med Chem 49:232-45 (2006)  
Target
Name:
Dual specificity calcium/calmodulin-dependent 3',5'-cyclic nucleotide phosphodiesterase 1A/1B
Synonyms:
Phosphodiesterase 1
Type:
Mol. Mass.:
Description:
ASSAY_ID of ChEMBL is 156011
Components:
This complex has 2 components.
Component 1
Name:
Dual specificity calcium/calmodulin-dependent 3',5'-cyclic nucleotide phosphodiesterase 1B
Synonyms:
63 kDa Cam-PDE Cam-PDE 1B PDE1B1 | PDE1B_BOVIN
Type:
PROTEIN
Mol. Mass.:
60991.90
Organism:
Bos taurus
Description:
ChEMBL_104913
Residue:
534
  
Component 2
Name:
Dual specificity calcium/calmodulin-dependent 3',5'-cyclic nucleotide phosphodiesterase 1A
Synonyms:
Calcium/calmodulin-dependent 3',5'-cyclic nucleotide phosphodiesterase 1A PDE1A Phosphodiesterase 1 | Phosphodiesterase 1A
Type:
Enzyme Catalytic Domain
Mol. Mass.:
60835.05
Organism:
BOVINE
Description:
Phosphodiesterase 1 0 BOVINE::P14100
Residue:
530
  
Inhibitor
Name:
BDBM50009385
Synonyms:
1,4-butylenediamine CHEMBL46257 Putrescin Tetramethylendiamin butylenediamine putrescine
Type:
Small organic molecule
Emp. Form.:
C4H12N2
Mol. Mass.:
88.1515
SMILES:
NCCCCN
: