Target
Amine oxidase [flavin-containing] A
Ligand
BDBM50475872
Substrate
Meas. Tech.
ChEMBL_388187 (CHEMBL865447)
Ki
170±n/a nM
Citation
 Chimenti, FSecci, DBolasco, AChimenti, PGranese, ACarradori, SBefani, OTurini, PAlcaro, SOrtuso, F Synthesis, molecular modeling studies, and selective inhibitory activity against monoamine oxidase of N,N'-bis[2-oxo-2H-benzopyran]-3-carboxamides. Bioorg Med Chem Lett 16:4135-40 (2006)  
Target
Name:
Amine oxidase [flavin-containing] A
Synonyms:
AOFA_BOVIN MAO-A Monoamine Oxidase Type A (MAO-A) Monoamine oxidase A | Monoamine oxidase type A
Type:
PROTEIN
Mol. Mass.:
59764.63
Organism:
Bos taurus
Description:
ChEMBL_1501477
Residue:
527
  
Inhibitor
Name:
BDBM50475872
Synonyms:
CHEMBL212555
Type:
Small organic molecule
Emp. Form.:
C26H24N2O8
Mol. Mass.:
492.4774
SMILES:
COc1ccc2cc(C(=O)NCCCCNC(=O)c3cc4ccc(OC)cc4oc3=O)c(=O)oc2c1
: