Target
Amine oxidase [flavin-containing] B
Ligand
BDBM50475873
Substrate
Meas. Tech.
ChEMBL_388188 (CHEMBL865448)
Ki
1738±n/a nM
Citation
 Chimenti, FSecci, DBolasco, AChimenti, PGranese, ACarradori, SBefani, OTurini, PAlcaro, SOrtuso, F Synthesis, molecular modeling studies, and selective inhibitory activity against monoamine oxidase of N,N'-bis[2-oxo-2H-benzopyran]-3-carboxamides. Bioorg Med Chem Lett 16:4135-40 (2006)  
Target
Name:
Amine oxidase [flavin-containing] B
Synonyms:
AOFB_BOVIN MAO-B Monoamine Oxidase Type B (MAO-B) Monoamine oxidase B | Monoamine oxidase type B
Type:
PROTEIN
Mol. Mass.:
58428.94
Organism:
Bos taurus
Description:
ChEMBL_1501478
Residue:
520
  
Inhibitor
Name:
BDBM50475873
Synonyms:
CHEMBL211141
Type:
Small organic molecule
Emp. Form.:
C26H16N2O6
Mol. Mass.:
452.415
SMILES:
O=C(Nc1ccc(NC(=O)c2cc3ccccc3oc2=O)cc1)c1cc2ccccc2oc1=O
: