Target
Amine oxidase [flavin-containing] A
Ligand
BDBM50475874
Substrate
Meas. Tech.
ChEMBL_388187 (CHEMBL865447)
Ki
182±n/a nM
Citation
 Chimenti, FSecci, DBolasco, AChimenti, PGranese, ACarradori, SBefani, OTurini, PAlcaro, SOrtuso, F Synthesis, molecular modeling studies, and selective inhibitory activity against monoamine oxidase of N,N'-bis[2-oxo-2H-benzopyran]-3-carboxamides. Bioorg Med Chem Lett 16:4135-40 (2006)  
Target
Name:
Amine oxidase [flavin-containing] A
Synonyms:
AOFA_BOVIN MAO-A Monoamine Oxidase Type A (MAO-A) Monoamine oxidase A | Monoamine oxidase type A
Type:
PROTEIN
Mol. Mass.:
59764.63
Organism:
Bos taurus
Description:
ChEMBL_1501477
Residue:
527
  
Inhibitor
Name:
BDBM50475874
Synonyms:
CHEMBL378988
Type:
Small organic molecule
Emp. Form.:
C26H22N2O6
Mol. Mass.:
458.4627
SMILES:
O=C(N[C@H]1CCCC[C@@H]1NC(=O)c1cc2ccccc2oc1=O)c1cc2ccccc2oc1=O
: