Target
Amine oxidase [flavin-containing] A
Ligand
BDBM50475873
Substrate
Meas. Tech.
ChEMBL_388187 (CHEMBL865447)
Ki
2399±n/a nM
Citation
 Chimenti, FSecci, DBolasco, AChimenti, PGranese, ACarradori, SBefani, OTurini, PAlcaro, SOrtuso, F Synthesis, molecular modeling studies, and selective inhibitory activity against monoamine oxidase of N,N'-bis[2-oxo-2H-benzopyran]-3-carboxamides. Bioorg Med Chem Lett 16:4135-40 (2006)  
Target
Name:
Amine oxidase [flavin-containing] A
Synonyms:
AOFA_BOVIN MAO-A Monoamine Oxidase Type A (MAO-A) Monoamine oxidase A | Monoamine oxidase type A
Type:
PROTEIN
Mol. Mass.:
59764.63
Organism:
Bos taurus
Description:
ChEMBL_1501477
Residue:
527
  
Inhibitor
Name:
BDBM50475873
Synonyms:
CHEMBL211141
Type:
Small organic molecule
Emp. Form.:
C26H16N2O6
Mol. Mass.:
452.415
SMILES:
O=C(Nc1ccc(NC(=O)c2cc3ccccc3oc2=O)cc1)c1cc2ccccc2oc1=O
: