Target
Alpha-1A adrenergic receptor
Ligand
BDBM50476087
Substrate
Meas. Tech.
ChEMBL_425082 (CHEMBL912601)
Ki
3.5±n/a nM
Citation
 Romeo, GMateria, LMarucci, GModica, MPittalą, VSalerno, LSiracusa, MABuccioni, MAngeli, PMinneman, KP New pyrimido[5,4-b]indoles and [1]benzothieno[3,2-d]pyrimidines: high affinity ligands for the alpha(1)-adrenoceptor subtypes. Bioorg Med Chem Lett 16:6200-3 (2006)  
Target
Name:
Alpha-1A adrenergic receptor
Synonyms:
ADA1A_HUMAN ADRA1C Alpha 1A-adrenoceptor Alpha adrenergic receptor 1a Alpha-adrenergic receptor 1c adrenergic Alpha1 | adrenergic Alpha1C
Type:
Cell-surface receptors
Mol. Mass.:
51511.67
Organism:
Homo sapiens (Human)
Description:
P35348
Residue:
466
  
Inhibitor
Name:
BDBM50476087
Synonyms:
CHEMBL222896
Type:
Small organic molecule
Emp. Form.:
C24H25ClN4O2S
Mol. Mass.:
468.999
SMILES:
COc1ccc(Cl)cc1N1CCN(CCn2c(C)nc3c4ccccc4sc3c2=O)CC1
: