Target
Substance-K receptor
Ligand
BDBM50476222
Substrate
Meas. Tech.
ChEMBL_430641 (CHEMBL918150)
Ki
0.158489±n/a nM
Citation
 Fedi, VAltamura, MBalacco, GCanfarini, FCriscuoli, MGiannotti, DGiolitti, AGiuliani, SGuidi, AHarmat, NJNannicini, RPasqui, FPatacchini, RPerrotta, ETramontana, MTriolo, AMaggi, CA Insertion of an aspartic acid moiety into cyclic pseudopeptides: synthesis and biological characterization of potent antagonists for the human Tachykinin NK-2 receptor. J Med Chem 47:6935-47 (2004)  
Target
Name:
Substance-K receptor
Synonyms:
NK-2 receptor NK2R NKNAR Neurokinin A receptor Neurokinin-2 (NK-2) SKR TACR2 Tachykinin receptor 2 (NK2) | hnk-3
Type:
Protein
Mol. Mass.:
44455.78
Organism:
Homo sapiens (Human)
Description:
P21452
Residue:
398
  
Inhibitor
Name:
BDBM50476222
Synonyms:
CHEMBL266284
Type:
Small organic molecule
Emp. Form.:
C39H46N6O5
Mol. Mass.:
678.8197
SMILES:
CN(C1CCOCC1)[C@@H]1CC(=O)N[C@@H](Cc2c[nH]c3ccccc23)C(=O)N[C@@H](Cc2ccccc2)C(=O)N[C@H](Cc2ccccc2)CNC1=O
: