Target
HIV-1 protease
Ligand
BDBM8125
Substrate
Meas. Tech.
ChEMBL_445722 (CHEMBL896013)
Ki
1.3±n/a nM
Citation
 Wang, YFTie, YBoross, PITozser, JGhosh, AKHarrison, RWWeber, IT Potent new antiviral compound shows similar inhibition and structural interactions with drug resistant mutants and wild type HIV-1 protease. J Med Chem 50:4509-15 (2007)  
Target
Name:
HIV-1 protease
Synonyms:
HIV-1 protease
Type:
PROTEIN
Mol. Mass.:
10795.19
Organism:
Human immunodeficiency virus
Description:
ChEMBL_118439
Residue:
99
  
Inhibitor
Name:
BDBM8125
Synonyms:
(3R,3aS,6aR)-hexahydrofuro[2,3-b]furan-3-yl N-[(2S,3R)-4-[(4-aminobenzene)(2-methylpropyl)sulfonamido]-3-hydroxy-1-phenylbutan-2-yl]carbamate Darunavir TMC-114 US10806794, Compound Darunavir
Type:
Small organic molecule
Emp. Form.:
C27H37N3O7S
Mol. Mass.:
547.664
SMILES:
[H][C@@]1(CO[C@@]2([H])OCC[C@@]12[H])OC(=O)N[C@@H](Cc1ccccc1)[C@H](O)CN(CC(C)C)S(=O)(=O)c1ccc(N)cc1
: