Target
Integrase
Ligand
BDBM107681
Substrate
Meas. Tech.
ChEMBL_458970 (CHEMBL925064)
IC50
3500±n/a nM
Citation
 Dubey, SSatyanarayana, YDLavania, H Development of integrase inhibitors for treatment of AIDS: an overview. Eur J Med Chem 42:1159-68 (2007)  
Target
Name:
Integrase
Synonyms:
pol
Type:
PROTEIN
Mol. Mass.:
32203.43
Organism:
Human immunodeficiency virus 1
Description:
ChEMBL_106649
Residue:
288
  
Inhibitor
Name:
BDBM107681
Synonyms:
(2Z)-4-[3,5-bis(benzyloxy)phenyl]-2-hydroxy-4- oxobut-2-enoic acid (Compound 2) CHEMBL320261
Type:
Small organic molecule
Emp. Form.:
C24H20O6
Mol. Mass.:
404.412
SMILES:
OC(=O)C(=O)CC(=O)c1cc(OCc2ccccc2)cc(OCc2ccccc2)c1
: