Target
Ornithine decarboxylase
Ligand
BDBM50020273
Substrate
Meas. Tech.
ChEBML_148131
Ki
75000±n/a nM
Citation
 Bey, PGerhart, FVan Dorsselaer, VDanzin, C alpha-(Fluoromethyl)dehydroornithine and alpha-(fluoromethyl)dehydroputrescine analogues as irreversible inhibitors of ornithine decarboxylase. J Med Chem 26:1551-6 (1983)  
Target
Name:
Ornithine decarboxylase
Synonyms:
DCOR_RAT Odc1
Type:
PROTEIN
Mol. Mass.:
51037.04
Organism:
Rattus norvegicus
Description:
ChEMBL_1344641
Residue:
461
  
Inhibitor
Name:
BDBM50020273
Synonyms:
2,5-Diamino-2-fluoromethyl-pentanoic acid | CHEMBL38759
Type:
Small organic molecule
Emp. Form.:
C6H13FN2O2
Mol. Mass.:
164.178
SMILES:
NCCCC(N)(CF)C(O)=O
: