Target
Ornithine decarboxylase
Ligand
BDBM50028196
Substrate
Meas. Tech.
ChEBML_148131
Ki
60000±n/a nM
Citation
 Bey, PGerhart, FVan Dorsselaer, VDanzin, C alpha-(Fluoromethyl)dehydroornithine and alpha-(fluoromethyl)dehydroputrescine analogues as irreversible inhibitors of ornithine decarboxylase. J Med Chem 26:1551-6 (1983)  
Target
Name:
Ornithine decarboxylase
Synonyms:
DCOR_RAT Odc1
Type:
PROTEIN
Mol. Mass.:
51037.04
Organism:
Rattus norvegicus
Description:
ChEMBL_1344641
Residue:
461
  
Inhibitor
Name:
BDBM50028196
Synonyms:
5,5-Difluoro-pent-2-ene-1,4-diamine | CHEMBL41597
Type:
Small organic molecule
Emp. Form.:
C5H10F2N2
Mol. Mass.:
136.1431
SMILES:
NC\C=C\C(N)C(F)F
: