Target
Ornithine decarboxylase
Ligand
BDBM50028199
Substrate
Meas. Tech.
ChEBML_148131
Ki
2700±n/a nM
Citation
 Bey, PGerhart, FVan Dorsselaer, VDanzin, C alpha-(Fluoromethyl)dehydroornithine and alpha-(fluoromethyl)dehydroputrescine analogues as irreversible inhibitors of ornithine decarboxylase. J Med Chem 26:1551-6 (1983)  
Target
Name:
Ornithine decarboxylase
Synonyms:
DCOR_RAT Odc1
Type:
PROTEIN
Mol. Mass.:
51037.04
Organism:
Rattus norvegicus
Description:
ChEMBL_1344641
Residue:
461
  
Inhibitor
Name:
BDBM50028199
Synonyms:
2,5-Diamino-2-fluoromethyl-pent-3-enoic acid | CHEMBL37859
Type:
Small organic molecule
Emp. Form.:
C6H11FN2O2
Mol. Mass.:
162.1621
SMILES:
NC\C=C\C(N)(CF)C(O)=O
: