Target
Integrase
Ligand
BDBM50183273
Substrate
Meas. Tech.
ChEMBL_479723 (CHEMBL921483)
IC50
4.0±n/a nM
Citation
 De Luca, LBarreca, MLFerro, SIraci, NMichiels, MChrist, FDebyser, ZWitvrouw, MChimirri, A A refined pharmacophore model for HIV-1 integrase inhibitors: Optimization of potency in the 1H-benzylindole series. Bioorg Med Chem Lett 18:2891-5 (2008)  
Target
Name:
Integrase
Synonyms:
pol
Type:
PROTEIN
Mol. Mass.:
32203.43
Organism:
Human immunodeficiency virus 1
Description:
ChEMBL_106649
Residue:
288
  
Inhibitor
Name:
BDBM50183273
Synonyms:
(S)-6-(3-chloro-2-fluorobenzyl)-1-(1-hydroxy-3-methylbutan-2-yl)-7-methoxy-4-oxo-1,4-dihydroquinoline-3-carboxylic acid 6-(3-chloro-2-fluorobenzyl)-1-[(1S)-1-(hydroxymethyl)-2-methylpropyl]-7-methoxy-4-oxo-1,4-dihydroquinoline-3-carboxylic acid ELVITEGRAVIR
Type:
Small organic molecule
Emp. Form.:
C23H23ClFNO5
Mol. Mass.:
447.884
SMILES:
COc1cc2n(cc(C(O)=O)c(=O)c2cc1Cc1cccc(Cl)c1F)[C@H](CO)C(C)C
: