Target
DNA polymerase subunit gamma-1
Ligand
BDBM50478747
Substrate
Meas. Tech.
ChEMBL_506014 (CHEMBL950609)
Kd
6000±n/a nM
Citation
 Hanes, JWZhu, YParris, DSJohnson, KA Enzymatic therapeutic index of acyclovir. Viral versus human polymerase gamma specificity. J Biol Chem 282:25159-67 (2007)  
Target
Name:
DNA polymerase subunit gamma-1
Synonyms:
DNA Polymerase gamma DNA polymerase (alpha/delta/epsilon) DNA polymerase delta subunit 1 DNA polymerase gamma subunit 1 DNA polymerase kappa DNA polymerase subunit gamma-1 DPOG1_HUMAN Mitochondrial DNA polymerase catalytic subunit POLG1 PolG-alpha
Type:
Enzyme Subunit
Mol. Mass.:
139566.98
Organism:
Homo sapiens (Human)
Description:
Enzyme was purchased from Ulrich Hubscher, University of Zurich-Irchel, Switzerland.
Residue:
1239
  
Inhibitor
Name:
BDBM50478747
Synonyms:
Acyclovir triphosphate
Type:
Small organic molecule
Emp. Form.:
C8H14N5O12P3
Mol. Mass.:
465.1443
SMILES:
Nc1nc2n(COCCOP(O)(=O)OP(O)(=O)OP(O)(O)=O)cnc2c(=O)[nH]1
: