Target
Reverse transcriptase protein
Ligand
BDBM50164644
Substrate
Meas. Tech.
ChEMBL_490001 (CHEMBL984664)
Ki
50±n/a nM
Citation
 Marchand, BWhite, KLLy, JKMargot, NAWang, RMcDermott, MMiller, MDGötte, M Effects of the translocation status of human immunodeficiency virus type 1 reverse transcriptase on the efficiency of excision of tenofovir. Antimicrob Agents Chemother 51:2911-9 (2007)  
Target
Name:
Reverse transcriptase protein
Synonyms:
Reverse Transcriptase Reverse Transcriptase (F61A)
Type:
Protein
Mol. Mass.:
30203.56
Organism:
Human immunodeficiency virus 1
Description:
Q9WJQ2
Residue:
259
  
Inhibitor
Name:
BDBM50164644
Synonyms:
2',3'-Dideoxyadenosine Triphosphate (Ddatp) ATP,2',3'-dideoxy [[[5-(6-amino-9H-purin-9-yl)tetrahydrofuran-2-yl]methoxy-hydroxy-phosphoryl]oxy-hydroxy-phosphoryl]oxyphosphonic acid ddATP
Type:
Small organic molecule
Emp. Form.:
C10H16N5O11P3
Mol. Mass.:
475.1822
SMILES:
Nc1ncnc2n(cnc12)[C@H]1CC[C@@H](COP(O)(=O)OP(O)(=O)OP(O)(O)=O)O1
: