Target
Reverse transcriptase
Ligand
BDBM50478975
Substrate
Meas. Tech.
ChEMBL_490007 (CHEMBL984670)
Kd
24900±n/a nM
Citation
 Marchand, BWhite, KLLy, JKMargot, NAWang, RMcDermott, MMiller, MDGötte, M Effects of the translocation status of human immunodeficiency virus type 1 reverse transcriptase on the efficiency of excision of tenofovir. Antimicrob Agents Chemother 51:2911-9 (2007)  
Target
Name:
Reverse transcriptase
Synonyms:
Type:
Protein
Mol. Mass.:
29598.37
Organism:
Human immunodeficiency virus 1
Description:
Q9WKE8
Residue:
254
  
Inhibitor
Name:
BDBM50478975
Synonyms:
AZIDOTHYMIDINE MONOPHOSPHATE | Zidovudine Monophosphate
Type:
Small organic molecule
Emp. Form.:
C10H14N5O7P
Mol. Mass.:
347.2212
SMILES:
Cc1cn([C@H]2C[C@H](N=[N+]=[N-])[C@@H](COP(O)(O)=O)O2)c(=O)[nH]c1=O
: