Target
Pepsin A
Ligand
BDBM50028312
Substrate
Meas. Tech.
ChEBML_154165
Ki
1.1±n/a nM
Citation
 Rich, DHSun, ETUlm, E Synthesis of analogues of the carboxyl protease inhibitor pepstatin. Effects of structure on inhibition of pepsin and renin. J Med Chem 23:27-33 (1980)  
Target
Name:
Pepsin A
Synonyms:
PEPA_PIG Pepsin | Pepsin A precursor
Type:
Enzyme
Mol. Mass.:
41232.87
Organism:
Porcine
Description:
Residue:
385
  
Inhibitor
Name:
BDBM50028312
Synonyms:
3-Hydroxy-6-methyl-4-[3-methyl-2-(3-methyl-butyrylamino)-butyrylamino]-heptanoic acid [1-(3-methyl-butylcarbamoyl)-ethyl]-amide | CHEMBL113257
Type:
Small organic molecule
Emp. Form.:
C26H50N4O5
Mol. Mass.:
498.699
SMILES:
CC(C)CCNC(=O)[C@H](C)NC(=O)C[C@H](O)C(CC(C)C)NC(=O)[C@H](NC(=O)CC(C)C)C(C)C
: