Target
Voltage-dependent L-type calcium channel subunit alpha-1S
Ligand
BDBM81464
Substrate
Meas. Tech.
ChEMBL_512033 (CHEMBL970836)
Ki
1080±n/a nM
Citation
 Carosati, EBudriesi, RIoan, PUgenti, MPFrosini, MFusi, FCorda, GCosimelli, BSpinelli, DChiarini, ACruciani, G Discovery of novel and cardioselective diltiazem-like calcium channel blockers via virtual screening. J Med Chem 51:5552-65 (2008)  
Target
Name:
Voltage-dependent L-type calcium channel subunit alpha-1S
Synonyms:
CAC1S_RAT Cacn1 Cacnl1a3 Cchl1a3 Voltage-gated L-type calcium channel Voltage-gated calcium channel subunit alpha Cav1.1
Type:
PROTEIN
Mol. Mass.:
210392.58
Organism:
Rattus norvegicus
Description:
ChEMBL_92777
Residue:
1850
  
Inhibitor
Name:
BDBM81464
Synonyms:
2-[(4-chlorophenyl)-(2-pyridyl)methoxy]ethyl-dimethyl-amine;fumaric acid Carbinoxamine | NSC_2564
Type:
Small organic molecule
Emp. Form.:
C16H19ClN2O
Mol. Mass.:
290.788
SMILES:
CN(C)CCOC(c1ccc(Cl)cc1)c1ccccn1
: