Target
Choline/ethanolaminephosphotransferase 1
Ligand
BDBM50481308
Substrate
Meas. Tech.
ChEMBL_606314 (CHEMBL1070006)
IC50
2000±n/a nM
Citation
 Smith, CJAli, AChen, LHammond, MLAnderson, MSChen, YEveland, SSGuo, QHyland, SAMilot, DPSparrow, CPWright, SDSinclair, PJ 2-Arylbenzoxazoles as CETP inhibitors: Substitution of the benzoxazole moiety. Bioorg Med Chem Lett 20:346-9 (2010)  
Target
Name:
Choline/ethanolaminephosphotransferase 1
Synonyms:
2.7.8.1 CEPT1 Choline/ethanolaminephosphotransferase 1 | hCEPT1
Type:
PROTEIN
Mol. Mass.:
46568.68
Organism:
Homo sapiens
Description:
ChEMBL_117345
Residue:
416
  
Inhibitor
Name:
BDBM50481308
Synonyms:
CHEMBL594285
Type:
Small organic molecule
Emp. Form.:
C24H18N2O3
Mol. Mass.:
382.4113
SMILES:
Cc1ccccc1OCC(=O)Nc1ccc(cc1)-c1nc2cc(ccc2o1)C#C
: