Target
Endothelial PAS domain-containing protein 1/Hypoxia-inducible factor 1-alpha
Ligand
BDBM50481800
Substrate
Meas. Tech.
ChEMBL_621709 (CHEMBL1104951)
IC50
500±n/a nM
Citation
 Liu, YLiu, RMao, SCMorgan, JBJekabsons, MBZhou, YDNagle, DG Molecular-targeted antitumor agents. 19. Furospongolide from a marine Lendenfeldia sp. sponge inhibits hypoxia-inducible factor-1 activation in breast tumor cells. J Nat Prod 71:1854-60 (2008)  
Target
Name:
Endothelial PAS domain-containing protein 1/Hypoxia-inducible factor 1-alpha
Synonyms:
Hypoxia inducible factors; HIF-1-alpha, HIF-2-alpha
Type:
Mol. Mass.:
Description:
ASSAY_ID of ChEMBL is 799337
Components:
This complex has 2 components.
Component 1
Name:
Hypoxia-inducible factor 1-alpha
Synonyms:
BHLHE78 HIF-1-alpha, HIF-2-alpha HIF1A_HUMAN Hypoxia-inducible factor 1 alpha MOP1 von Hippel-Lindau disease tumor suppressor/Elongin-C/Elongin-B/HIF1A
Type:
Protein
Mol. Mass.:
92647.24
Organism:
Homo sapiens (Human)
Description:
Q16665
Residue:
826
  
Component 2
Name:
Endothelial PAS domain-containing protein 1
Synonyms:
BHLHE73 EPAS1_HUMAN MOP2 endothelial PAS domain-containing protein 1
Type:
PROTEIN
Mol. Mass.:
96453.58
Organism:
Homo sapiens (Human)
Description:
ChEMBL_1506501
Residue:
870
  
Inhibitor
Name:
BDBM50481800
Synonyms:
CHEMBL1086908
Type:
Small organic molecule
Emp. Form.:
C26H40O4
Mol. Mass.:
416.5934
SMILES:
[H][C@@]12CC[C@@]3(C)[C@]4([H])CC=C([C@H](C=O)[C@@]4(C)[C@@H](O)C[C@]3([H])[C@@]1(CO)CCCC2(C)C)C(C)=O
: