Target
Genome polyprotein
Ligand
BDBM50482345
Substrate
Meas. Tech.
ChEMBL_642270 (CHEMBL1177150)
Ki
230±n/a nM
Citation
 Lampa, AEhrenberg, AEGustafsson, SSVema, AKerblom, ELindeberg, GKarlén, ADanielson, UHSandström, A Improved P2 phenylglycine-based hepatitis C virus NS3 protease inhibitors with alkenylic prime-side substituents. Bioorg Med Chem 18:5413-24 (2010)  
Target
Name:
Genome polyprotein
Synonyms:
Protease NS3/Non-structural protein 4A (NS3/NS4A) | Protease NS3/Non-structural protein 4A (NS3/NS4A) (D168V)
Type:
Enzyme
Mol. Mass.:
19121.30
Organism:
Hepatitis C virus genotype 1b (isolate Con1) (HCV)
Description:
Q91RS4
Residue:
181
  
Inhibitor
Name:
BDBM50482345
Synonyms:
CHEMBL1170417
Type:
Small organic molecule
Emp. Form.:
C50H57N5O9S
Mol. Mass.:
904.081
SMILES:
CCC[C@H](NC(=O)[C@H](NC(=O)[C@@H](NC(=O)OC(C)(C)C)C(C)(C)C)c1ccc(Oc2cc(nc3cc(OC)ccc23)-c2ccccc2)c(C=C)c1)C(=O)NS(=O)(=O)c1ccccc1C=C
: