Target
Penicillin-binding protein 2B
Ligand
BDBM50482777
Substrate
Meas. Tech.
ChEMBL_672085 (CHEMBL1267466)
IC50
35100±n/a nM
Citation
 Kosowska-Shick, KMcGhee, PLAppelbaum, PC Affinity of ceftaroline and other beta-lactams for penicillin-binding proteins from Staphylococcus aureus and Streptococcus pneumoniae. Antimicrob Agents Chemother 54:1670-7 (2010)  
Target
Name:
Penicillin-binding protein 2B
Synonyms:
PBP2_STRPN pbp2b penA
Type:
PROTEIN
Mol. Mass.:
73859.38
Organism:
Streptococcus pneumoniae serotype 4 (strain ATCC BAA-334 / TIGR4)
Description:
ChEMBL_103544
Residue:
680
  
Inhibitor
Name:
BDBM50482777
Synonyms:
CHEBI:204928 | Cefotaxime
Type:
Small organic molecule
Emp. Form.:
C16H17N5O7S2
Mol. Mass.:
455.465
SMILES:
[H][C@]12SCC(COC(C)=O)=C(N1C(=O)[C@H]2NC(=O)C(=N/OC)\c1csc(N)n1)C(O)=O
: