Target
Neuraminidase
Ligand
BDBM5025
Substrate
Meas. Tech.
ChEMBL_676152 (CHEMBL1273203)
IC50
127±n/a nM
Citation
 Nguyen, PHNa, MDao, TTNdinteh, DTMbafor, JTPark, JCheong, HOh, WK New stilbenoid with inhibitory activity on viral neuraminidases from Erythrina addisoniae. Bioorg Med Chem Lett 20:6430-4 (2010)  
Target
Name:
Neuraminidase
Synonyms:
NA | NRAM_I33A0
Type:
PROTEIN
Mol. Mass.:
49687.56
Organism:
Influenza A virus
Description:
ChEMBL_1347422
Residue:
453
  
Inhibitor
Name:
BDBM5025
Synonyms:
Oseltamivir ethyl (3R,4R,5S)-5-amino-4-acetamido-3-(pentan-3-yloxy)cyclohex-1-ene-1-carboxylate
Type:
Small organic molecule
Emp. Form.:
C16H28N2O4
Mol. Mass.:
312.4045
SMILES:
[H][C@@]1(OC(CC)CC)C=C(C[C@H](N)[C@H]1NC(C)=O)C(=O)OCC
: