Target
Peptidase
Ligand
BDBM50129062
Substrate
Meas. Tech.
ChEMBL_677728 (CHEMBL1280506)
IC50
138000±n/a nM
Citation
 Koga, TMasuda, NKakuta, MNamba, ESugihara, CFukuoka, T Potent in vitro activity of tomopenem (CS-023) against methicillin-resistant Staphylococcus aureus and Pseudomonas aeruginosa. Antimicrob Agents Chemother 52:2849-54 (2008)  
Target
Name:
Peptidase
Synonyms:
MecA Penicillin binding protein 2 prime Penicillin binding protein 2a (PBP2a) Penicillin-binding protein 2'
Type:
PROTEIN
Mol. Mass.:
76113.18
Organism:
Staphylococcus aureus
Description:
ChEMBL_677175
Residue:
668
  
Inhibitor
Name:
BDBM50129062
Synonyms:
CHEBI:43968 Meropenem Merrem iv | SM-7338
Type:
Small organic molecule
Emp. Form.:
C17H25N3O5S
Mol. Mass.:
383.463
SMILES:
[H][C@]1([C@@H](C)O)C(=O)N2C(C(O)=O)=C(S[C@@H]3CN[C@@H](C3)C(=O)N(C)C)[C@H](C)[C@]12[H]
: