Target
Reverse transcriptase
Ligand
BDBM50483321
Substrate
Meas. Tech.
ChEMBL_701790 (CHEMBL1656927)
IC50
>100000±n/a nM
Citation
 Tang, JMaddali, KDreis, CDSham, YYVince, RPommier, YWang, Z N-3 Hydroxylation of Pyrimidine-2,4-diones Yields Dual Inhibitors of HIV Reverse Transcriptase and Integrase. ACS Med Chem Lett 2:63-67 (2011)  
Target
Name:
Reverse transcriptase
Synonyms:
Type:
Protein
Mol. Mass.:
29598.37
Organism:
Human immunodeficiency virus 1
Description:
Q9WKE8
Residue:
254
  
Inhibitor
Name:
BDBM50483321
Synonyms:
CHEMBL1651641
Type:
Small organic molecule
Emp. Form.:
C22H23FN2O4
Mol. Mass.:
398.4274
SMILES:
CC(C)c1c(Cc2ccc(F)cc2)n(COCc2ccccc2)c(=O)n(O)c1=O
: