Target
Reverse transcriptase
Ligand
BDBM50468814
Substrate
Meas. Tech.
ChEMBL_701790 (CHEMBL1656927)
IC50
>100000±n/a nM
Citation
 Tang, JMaddali, KDreis, CDSham, YYVince, RPommier, YWang, Z N-3 Hydroxylation of Pyrimidine-2,4-diones Yields Dual Inhibitors of HIV Reverse Transcriptase and Integrase. ACS Med Chem Lett 2:63-67 (2011)  
Target
Name:
Reverse transcriptase
Synonyms:
Type:
Protein
Mol. Mass.:
29598.37
Organism:
Human immunodeficiency virus 1
Description:
Q9WKE8
Residue:
254
  
Inhibitor
Name:
BDBM50468814
Synonyms:
CHEMBL1651646
Type:
Small organic molecule
Emp. Form.:
C17H21FN2O4
Mol. Mass.:
336.358
SMILES:
CCOCn1c(Cc2ccc(F)cc2)c(C(C)C)c(=O)n(O)c1=O
: