Target
Probable maltase-glucoamylase 2
Ligand
BDBM50502067
Substrate
Meas. Tech.
ChEMBL_1806296 (CHEMBL4305655)
IC50
100±n/a nM
Citation
 Dhameja, MGupta, P Synthetic heterocyclic candidates as promising ?-glucosidase inhibitors: An overview. Eur J Med Chem 176:343-377 (2019)  
Target
Name:
Probable maltase-glucoamylase 2
Synonyms:
3.2.1.3 Glucoamylase MGAM2 Probable maltase-glucoamylase 2
Type:
PROTEIN
Mol. Mass.:
277932.17
Organism:
Homo sapiens
Description:
ChEMBL_116927
Residue:
2515
  
Inhibitor
Name:
BDBM50502067
Synonyms:
CHEMBL4535006
Type:
Small organic molecule
Emp. Form.:
C38H30Br2N6O6S2
Mol. Mass.:
890.619
SMILES:
Cc1ccc(cc1)C(c1c[nH]c2ccc(cc12)C(=O)NNS(=O)(=O)c1ccc(Br)cc1)c1c[nH]c2ccc(cc12)C(=O)NNS(=O)(=O)c1ccc(Br)cc1
: