Target
Probable maltase-glucoamylase 2
Ligand
BDBM50502104
Substrate
Meas. Tech.
ChEMBL_1806312 (CHEMBL4305671)
IC50
100±n/a nM
Citation
 Dhameja, MGupta, P Synthetic heterocyclic candidates as promising ?-glucosidase inhibitors: An overview. Eur J Med Chem 176:343-377 (2019)  
Target
Name:
Probable maltase-glucoamylase 2
Synonyms:
3.2.1.3 Glucoamylase MGAM2 Probable maltase-glucoamylase 2
Type:
PROTEIN
Mol. Mass.:
277932.17
Organism:
Homo sapiens
Description:
ChEMBL_116927
Residue:
2515
  
Inhibitor
Name:
BDBM50502104
Synonyms:
CHEMBL4443277
Type:
Small organic molecule
Emp. Form.:
C20H11Cl3N2O3S
Mol. Mass.:
465.737
SMILES:
Cc1cs\c(=N/C(=O)c2cc3ccccc3oc2=O)n1-c1cc(Cl)c(Cl)cc1Cl
: