Target
Probable maltase-glucoamylase 2
Ligand
BDBM50502154
Substrate
Meas. Tech.
ChEMBL_1806320 (CHEMBL4305679)
IC50
70±n/a nM
Citation
 Dhameja, MGupta, P Synthetic heterocyclic candidates as promising ?-glucosidase inhibitors: An overview. Eur J Med Chem 176:343-377 (2019)  
Target
Name:
Probable maltase-glucoamylase 2
Synonyms:
3.2.1.3 Glucoamylase MGAM2 Probable maltase-glucoamylase 2
Type:
PROTEIN
Mol. Mass.:
277932.17
Organism:
Homo sapiens
Description:
ChEMBL_116927
Residue:
2515
  
Inhibitor
Name:
BDBM50502154
Synonyms:
CHEMBL4448529
Type:
Small organic molecule
Emp. Form.:
C50H36N6O6S2
Mol. Mass.:
880.987
SMILES:
Cc1ccc(cc1)C(Nc1ccc(cc1)-c1ccc(NC(c2ccc(C)cc2)n2nc(oc2=S)-c2cc3ccccc3oc2=O)cc1)n1nc(oc1=S)-c1cc(=O)oc2ccccc12
: