Target
Probable maltase-glucoamylase 2
Ligand
BDBM50502218
Substrate
Meas. Tech.
ChEMBL_1806312 (CHEMBL4305671)
IC50
100±n/a nM
Citation
 Dhameja, MGupta, P Synthetic heterocyclic candidates as promising ?-glucosidase inhibitors: An overview. Eur J Med Chem 176:343-377 (2019)  
Target
Name:
Probable maltase-glucoamylase 2
Synonyms:
3.2.1.3 Glucoamylase MGAM2 Probable maltase-glucoamylase 2
Type:
PROTEIN
Mol. Mass.:
277932.17
Organism:
Homo sapiens
Description:
ChEMBL_116927
Residue:
2515
  
Inhibitor
Name:
BDBM50502218
Synonyms:
CHEMBL4442767
Type:
Small organic molecule
Emp. Form.:
C18H13Cl3N2OS
Mol. Mass.:
411.733
SMILES:
Cc1cs\c(=N/C(=O)c2cccc(C)c2)n1-c1cc(Cl)c(Cl)cc1Cl
: