Target
Probable maltase-glucoamylase 2
Ligand
BDBM50502226
Substrate
Meas. Tech.
ChEMBL_1806312 (CHEMBL4305671)
IC50
90±n/a nM
Citation
 Dhameja, MGupta, P Synthetic heterocyclic candidates as promising ?-glucosidase inhibitors: An overview. Eur J Med Chem 176:343-377 (2019)  
Target
Name:
Probable maltase-glucoamylase 2
Synonyms:
3.2.1.3 Glucoamylase MGAM2 Probable maltase-glucoamylase 2
Type:
PROTEIN
Mol. Mass.:
277932.17
Organism:
Homo sapiens
Description:
ChEMBL_116927
Residue:
2515
  
Inhibitor
Name:
BDBM50502226
Synonyms:
CHEMBL4516968
Type:
Small organic molecule
Emp. Form.:
C26H15ClFN3O4S
Mol. Mass.:
519.931
SMILES:
Fc1ccc(\C=C2/S\C(=N/NC(=O)c3cc4ccccc4oc3=O)N(C2=O)c2ccc(Cl)cc2)cc1
: