Target
Probable maltase-glucoamylase 2
Ligand
BDBM50502227
Substrate
Meas. Tech.
ChEMBL_1806312 (CHEMBL4305671)
IC50
90±n/a nM
Citation
 Dhameja, MGupta, P Synthetic heterocyclic candidates as promising ?-glucosidase inhibitors: An overview. Eur J Med Chem 176:343-377 (2019)  
Target
Name:
Probable maltase-glucoamylase 2
Synonyms:
3.2.1.3 Glucoamylase MGAM2 Probable maltase-glucoamylase 2
Type:
PROTEIN
Mol. Mass.:
277932.17
Organism:
Homo sapiens
Description:
ChEMBL_116927
Residue:
2515
  
Inhibitor
Name:
BDBM50502227
Synonyms:
CHEMBL4589823
Type:
Small organic molecule
Emp. Form.:
C27H18FN3O4S
Mol. Mass.:
499.513
SMILES:
Cc1cccc(c1)N1\C(S\C(=C/c2ccc(F)cc2)C1=O)=N\NC(=O)c1cc2ccccc2oc1=O
: