Target
Integrase
Ligand
BDBM107681
Substrate
Meas. Tech.
ChEMBL_722511 (CHEMBL1675360)
IC50
3500±n/a nM
Citation
 Hombrouck, AVan Remoortel, BMichiels, MNoppe, WChrist, FEneroth, ASahlberg, BLBenkestock, KVrang, LJohansson, NGBarreca, MLDe Luca, LFerro, SChimirri, ADebyser, ZWitvrouw, M Preclinical evaluation of 1H-benzylindole derivatives as novel human immunodeficiency virus integrase strand transfer inhibitors. Antimicrob Agents Chemother 52:2861-9 (2008)  
Target
Name:
Integrase
Synonyms:
pol
Type:
PROTEIN
Mol. Mass.:
32203.43
Organism:
Human immunodeficiency virus 1
Description:
ChEMBL_106649
Residue:
288
  
Inhibitor
Name:
BDBM107681
Synonyms:
(2Z)-4-[3,5-bis(benzyloxy)phenyl]-2-hydroxy-4- oxobut-2-enoic acid (Compound 2) CHEMBL320261
Type:
Small organic molecule
Emp. Form.:
C24H20O6
Mol. Mass.:
404.412
SMILES:
OC(=O)C(=O)CC(=O)c1cc(OCc2ccccc2)cc(OCc2ccccc2)c1
: