Target
Aldo-keto reductase family 1 member C1
Ligand
BDBM50330427
Substrate
Meas. Tech.
ChEMBL_741159 (CHEMBL1764481)
Ki
1.2±n/a nM
Citation
 El-Kabbani, ODhagat, USoda, MEndo, SMatsunaga, THara, A Probing the inhibitor selectivity pocket of human 20?-hydroxysteroid dehydrogenase (AKR1C1) with X-ray crystallography and site-directed mutagenesis. Bioorg Med Chem Lett 21:2564-7 (2011)  
Target
Name:
Aldo-keto reductase family 1 member C1
Synonyms:
20-alpha-HSD AK1C1_HUMAN Aldo-keto reductase family 1 member C1 (AK1C1) Aldo-keto reductase family 1 member C1 (AKR1C1) DDH High-affinity hepatic bile acid-binding protein | Trans-1,2-dihydrobenzene-1,2-diol dehydrogenase
Type:
Enzyme
Mol. Mass.:
36793.97
Organism:
Homo sapiens (Human)
Description:
Recombinant AKR1C1 enzyme was expressed in E. coli.
Residue:
323
  
Inhibitor
Name:
BDBM50330427
Synonyms:
5-Chloro-4-hydroxybiphenyl-3-carboxylic acid | CHEMBL1275703
Type:
Small organic molecule
Emp. Form.:
C13H9ClO3
Mol. Mass.:
248.662
SMILES:
OC(=O)c1cc(cc(Cl)c1O)-c1ccccc1
: