Target
Metallo-beta-lactamase type 2
Ligand
BDBM50484533
Substrate
Meas. Tech.
ChEMBL_796098 (CHEMBL1936968)
Ki
13000±n/a nM
Citation
 Faridoon, naHussein, WMVella, PIslam, NUOllis, DLSchenk, GMcGeary, RP 3-mercapto-1,2,4-triazoles and N-acylated thiosemicarbazides as metallo-?-lactamase inhibitors. Bioorg Med Chem Lett 22:380-6 (2012)  
Target
Name:
Metallo-beta-lactamase type 2
Synonyms:
B2 metallo-beta-lactamase BLAB_SERMA IMP-1 | Metallo-beta-lactamase type II
Type:
undefined
Mol. Mass.:
27125.88
Organism:
Serratia marcescens
Description:
P52699
Residue:
246
  
Inhibitor
Name:
BDBM50484533
Synonyms:
CHEMBL1935522
Type:
Small organic molecule
Emp. Form.:
C15H13N3O2S
Mol. Mass.:
299.348
SMILES:
NC(=S)NNC(=O)c1ccc(cc1)C(=O)c1ccccc1
: