Target
2-amino-4-hydroxy-6-hydroxymethyldihydropteridine pyrophosphokinase
Ligand
BDBM50484527
Substrate
Meas. Tech.
ChEMBL_828090 (CHEMBL2049829)
Kd
470±n/a nM
Citation
 Shi, GShaw, GLi, YWu, YYan, HJi, X Bisubstrate analog inhibitors of 6-hydroxymethyl-7,8-dihydropterin pyrophosphokinase: new lead exhibits a distinct binding mode. Bioorg Med Chem 20:4303-9 (2012)  
Target
Name:
2-amino-4-hydroxy-6-hydroxymethyldihydropteridine pyrophosphokinase
Synonyms:
2-amino-4-hydroxy-6-hydroxymethyldihydropteridine pyrophosphokinase 7,8-dihydro-6-hydroxymethylpterin-pyrophosphokinase HPPK_ECOLI PPPK | folK
Type:
PROTEIN
Mol. Mass.:
18075.55
Organism:
Escherichia coli (strain K12)
Description:
ChEMBL_108237
Residue:
159
  
Inhibitor
Name:
BDBM50484527
Synonyms:
CHEMBL1928286
Type:
Small organic molecule
Emp. Form.:
C17H22N10O17P4
Mol. Mass.:
762.3084
SMILES:
Nc1nc2ncc(COP(O)(=O)OP(O)(=O)OP(O)(=O)OP(O)(=O)OC[C@H]3O[C@H]([C@H](O)[C@@H]3O)n3cnc4c(N)ncnc34)nc2c(=O)[nH]1
: