Target
Solute carrier family 22 member 6
Ligand
BDBM50370585
Substrate
Meas. Tech.
ChEMBL_838470 (CHEMBL2076041)
IC50
1600000±n/a nM
Citation
 Cihlar, THo, ES Fluorescence-based assay for the interaction of small molecules with the human renal organic anion transporter 1. Anal Biochem 283:49-55 (2000)  
Target
Name:
Solute carrier family 22 member 6
Synonyms:
OAT1 PAH transporter Renal organic anion transporter 1 SLC22A6 hPAHT | hROAT1
Type:
PROTEIN
Mol. Mass.:
61831.78
Organism:
Homo sapiens (Human)
Description:
ChEMBL_1487359
Residue:
563
  
Inhibitor
Name:
BDBM50370585
Synonyms:
Anspor Cefradine
Type:
Small organic molecule
Emp. Form.:
C16H19N3O4S
Mol. Mass.:
349.405
SMILES:
CC1=C(N2[C@H](SC1)[C@H](NC(=O)[C@H](N)C1=CCC=CC1)C2=O)C(O)=O
: