Target
Solute carrier family 15 member 1
Ligand
BDBM50485595
Substrate
Meas. Tech.
ChEMBL_836472 (CHEMBL2077002)
Ki
33000±n/a nM
Citation
 Knütter, ITheis, SHartrodt, BBorn, IBrandsch, MDaniel, HNeubert, K A novel inhibitor of the mammalian peptide transporter PEPT1. Biochemistry 40:4454-8 (2001)  
Target
Name:
Solute carrier family 15 member 1
Synonyms:
Intestinal H(+)/peptide cotransporter Oligopeptide transporter, small intestine isoform Peptide transporter 1 SLC15A1
Type:
PROTEIN
Mol. Mass.:
78818.07
Organism:
Homo sapiens (Human)
Description:
ChEMBL_1488839
Residue:
708
  
Inhibitor
Name:
BDBM50485595
Synonyms:
CHEMBL2074654
Type:
Small organic molecule
Emp. Form.:
C19H27N3O5
Mol. Mass.:
377.4348
SMILES:
NCCCC[C@H](NC(=O)OCc1ccccc1)C(=O)N1CCC[C@H]1C(O)=O
: