Target
Multidrug resistance-associated protein 1
Ligand
BDBM50485611
Substrate
Meas. Tech.
ChEMBL_835969 (CHEMBL2077107)
IC50
6.96±n/a nM
Citation
 Li, LPan, QSun, MLu, QHu, X Dibenzocyclooctadiene lignans: a class of novel inhibitors of multidrug resistance-associated protein 1. Life Sci 80:741-8 (2007)  
Target
Name:
Multidrug resistance-associated protein 1
Synonyms:
7.6.2.2 ABCC1 ATP-binding cassette, sub-family C, member 1 isoform 1 LTC4 transporter MRP MRP1_HUMAN
Type:
Mol. Mass.:
171597.72
Organism:
Homo sapiens (Human)
Description:
P33527
Residue:
1531
  
Inhibitor
Name:
BDBM50485611
Synonyms:
SCHISANDRIN A
Type:
Small organic molecule
Emp. Form.:
C24H32O6
Mol. Mass.:
416.5073
SMILES:
COc1cc2C[C@H](C)[C@H](C)Cc3cc(OC)c(OC)c(OC)c3-c2c(OC)c1OC
: