Target
Multidrug resistance-associated protein 1
Ligand
BDBM50341711
Substrate
Meas. Tech.
ChEMBL_835969 (CHEMBL2077107)
IC50
9.49±n/a nM
Citation
 Li, LPan, QSun, MLu, QHu, X Dibenzocyclooctadiene lignans: a class of novel inhibitors of multidrug resistance-associated protein 1. Life Sci 80:741-8 (2007)  
Target
Name:
Multidrug resistance-associated protein 1
Synonyms:
7.6.2.2 ABCC1 ATP-binding cassette, sub-family C, member 1 isoform 1 LTC4 transporter MRP MRP1_HUMAN
Type:
Mol. Mass.:
171597.72
Organism:
Homo sapiens (Human)
Description:
P33527
Residue:
1531
  
Inhibitor
Name:
BDBM50341711
Synonyms:
CHEMBL479488 | schisandrin B
Type:
Small organic molecule
Emp. Form.:
C23H28O6
Mol. Mass.:
400.4648
SMILES:
COc1cc2CC(C)C(C)Cc3cc4OCOc4c(OC)c3-c2c(OC)c1OC
: