Target
Solute carrier family 22 member 5
Ligand
BDBM50103624
Substrate
Meas. Tech.
ChEMBL_836620 (CHEMBL2077361)
IC50
230000±n/a nM
Citation
 Ganapathy, MEHuang, WRajan, DPCarter, ALSugawara, MIseki, KLeibach, FHGanapathy, V beta-lactam antibiotics as substrates for OCTN2, an organic cation/carnitine transporter. J Biol Chem 275:1699-707 (2000)  
Target
Name:
Solute carrier family 22 member 5
Synonyms:
High-affinity sodium-dependent carnitine cotransporter OCTN2_HUMAN SLC22A5 | Solute carrier family 22 member 5
Type:
PROTEIN
Mol. Mass.:
62756.52
Organism:
Homo sapiens
Description:
ChEMBL_104634
Residue:
557
  
Inhibitor
Name:
BDBM50103624
Synonyms:
40602 Cefaloridine Kefloridin | Loridine
Type:
Small organic molecule
Emp. Form.:
C19H17N3O4S2
Mol. Mass.:
415.486
SMILES:
[H][C@]12SCC(C[n+]3ccccc3)=C(N1C(=O)[C@H]2NC(=O)Cc1cccs1)C([O-])=O
: