Target
Adenosine deaminase
Ligand
BDBM50029130
Substrate
Meas. Tech.
ChEMBL_30810 (CHEMBL645085)
pH
7±n/a
Ki
5000±n/a nM
Comments
extracted
Citation
 Grant, AJLerner, LM Heat-induced formation of alpha,beta-unsaturated nucleoside dialdehydes and their activity with adenosine deaminase. J Med Chem 23:795-8 (1980)  
Target
Name:
Adenosine deaminase
Synonyms:
ADA Adenosine aminohydrolase
Type:
Enzyme
Mol. Mass.:
40910.44
Organism:
Bos taurus (bovine)
Description:
Residue:
363
  
Inhibitor
Name:
BDBM50029130
Synonyms:
Adenosine dialdehyde | CHEMBL165876
Type:
Small organic molecule
Emp. Form.:
C10H11N5O4
Mol. Mass.:
265.2254
SMILES:
Nc1ncnc2n(cnc12)[C@H](O[C@H](CO)C=O)C=O
: