Target
Adenosine deaminase
Ligand
BDBM50029134
Substrate
Meas. Tech.
ChEBML_30810
pH
7±n/a
Ki
46000±n/a nM
Comments
extracted
Citation
 Grant, AJLerner, LM Heat-induced formation of alpha,beta-unsaturated nucleoside dialdehydes and their activity with adenosine deaminase. J Med Chem 23:795-8 (1980)  
Target
Name:
Adenosine deaminase
Synonyms:
ADA Adenosine aminohydrolase
Type:
Enzyme
Mol. Mass.:
40910.44
Organism:
Bos taurus (bovine)
Description:
Residue:
363
  
Inhibitor
Name:
BDBM50029134
Synonyms:
(2R)-2-(6-amino-9H-purin-9-yl)-2-(2-oxoethoxy)acetaldehyde | CHEMBL351404
Type:
Small organic molecule
Emp. Form.:
C9H9N5O3
Mol. Mass.:
235.1995
SMILES:
Nc1ncnc2n(cnc12)[C@H](OCC=O)C=O
: